{"text_format":"1","workbook":"xlsx","n_sheets":21,"sheets":["START","Instructions","Template names","Lookup and lists","F1-Sum","F2-FinPerf","F3-Capex","F4-FinPos","F5-CFlow","SF1","SF2","SF3","SF4","SF5","SF6","SF7","SF8a","SF8b","SF8c","SF8d","SF8e"],"not_rendered":{"charts":0,"images":18,"macros":1,"external_links":1,"defined_names":116,"comments":0,"pivot_tables":0},"unopened":[],"bounds":{"document_bytes":16777216,"sheet_cells":100000,"rows_first":2000,"rows_last":500,"rows_between":2000,"halvings":0,"cell_chars":16384,"cell_head_chars":4096},"cells_cut":0,"cells_raw":0,"read":"whole","date_system":"1900"}

{"sheet":"START","index":0,"n_rows":1,"n_cols":1,"rows_kept":1,"cut":false,"hidden":false,"merged":[]}
[{"$f":"'Lookup and lists'!B28","v":"Choose name from list"}]

{"sheet":"Instructions","index":1,"n_rows":55,"n_cols":24,"rows_kept":55,"cut":false,"hidden":false,"merged":[]}
[]
[null,null,null,2020]
[]
[null,null,null,null,null,null,null,null,null,null,null,null,null,null,null,null,null,null,null,null,null,null,null,"Yes"]
[null,null,null,null,null,null,null,null,null,null,null,null,null,null,null,null,null,null,null,null,null,null,null,"No"]
[]
[null,null,null,null,null,null,null,null,null,null,null,null,null,null,null,null,null,null,null,null,null,null,"Type of Entities Range:","Parent Municapality"]
[null,null,null,null,null,null,null,null,null,null,null,null,null,null,null,null,null,null,null,null,null,null,null,"Consolidated Information"]
{"$rows_left_out":48}
{"sheet":"Template names","index":2,"n_rows":98,"n_cols":4,"rows_kept":98,"cut":false,"hidden":true,"merged":[[0,0,0,3],[77,0,77,1],[74,0,74,3]]}
["Common sheet headings"]
["Head1",{"$f":"HLOOKUP(MTREF,Headings,2)","v":"2023/24"},"Prior year -1"]
["Head1A",{"$f":"HLOOKUP(MTREF,Headings,3)","v":"2022/23"},"Prior year -2"]
["Head1B",{"$f":"HLOOKUP(MTREF,Headings,4)","v":"2021/22"},"Prior year -3"]
["Head2",{"$f":"HLOOKUP(MTREF,Headings,5)","v":"Current Year 2024/25"},"Year in which budget is being prepared"]
["Head2A",{"$f":"HLOOKUP(MTREF,Headings,6)","v":"2024/25"},"Year in which budget is being prepared"]
["Head3",{"$f":"HLOOKUP(MTREF,Headings,7)","v":"2025/26 Medium Term Revenue & Expenditure Framework"},"MTREF name"]
["Head3A","Medium Term Revenue and Expenditure Framework"]
{"$rows_left_out":91}
{"sheet":"Lookup and lists","index":3,"n_rows":286,"n_cols":15,"rows_kept":286,"cut":false,"hidden":true,"merged":[]}
["Description",2013,2014,2015,2016,2017,2018,2019,2020,2021,2022,2023,2024,2025,2026]
["Prior year -1",{"$f":"B1-2&\"/\"&RIGHT(B1,2)-1","v":"2011/12"},"2012/13","2013/14","2014/15","2015/16","2016/17","2017/18","2018/19","2019/20","2020/21","2021/22","2022/23","2023/24","2024/25"]
["Prior year -2",{"$f":"B1-3&\"/\"&RIGHT(B1,2)-2","v":"2010/11"},"2011/12","2012/13","2013/14","2014/15","2015/16","2016/17","2017/18","2018/19","2019/20","2020/21","2021/22","2022/23","2023/24"]
["Prior year -3",{"$f":"B1-4&\"/\"&RIGHT(B1,2)-3","v":"2009/10"},"2010/11","2011/12","2012/13","2013/14","2014/15","2015/16","2016/17","2017/18","2018/19","2019/20","2020/21","2021/22","2022/23"]
["Year in which budget is being prepared",{"$f":"\"Current Year \"& B1-1&\"/\"&RIGHT(B1,2)","v":"Current Year 2012/13"},"Current Year 2013/14","Current Year 2014/15","Current Year 2015/16","Current Year 2016/17","Current Year 2017/18","Current Year 2018/19","Current Year 2019/20","Current Year 2020/21","Current Year 2021/22","Current Year 2022/23","Current Year 2023/24","Current Year 2024/25","Current Year 2025/26"]
["Year in which budget is being prepared",{"$f":"B1-1&\"/\"&RIGHT(B1,2)","v":"2012/13"},"2013/14","2014/15","2015/16","2016/17","2017/18","2018/19","2019/20","2020/21","2021/22","2022/23","2023/24","2024/25","2025/26"]
["MTREF name",{"$f":"B1&\"/\"&RIGHT(B1,2)+1&\" Medium Term Revenue & Expenditure Framework\"","v":"2013/14 Medium Term Revenue & Expenditure Framework"},"2014/15 Medium Term Revenue & Expenditure Framework","2015/16 Medium Term Revenue & Expenditure Framework","2016/17 Medium Term Revenue & Expenditure Framework","2017/18 Medium Term Revenue & Expenditure Framework","2018/19 Medium Term Revenue & Expenditure Framework","2019/20 Medium Term Revenue & Expenditure Framework","2020/21 Medium Term Revenue & Expenditure Framework","2021/22 Medium Term Revenue & Expenditure Framework","2022/23 Medium Term Revenue & Expenditure Framework","2023/24 Medium Term Revenue & Expenditure Framework","2024/25 Medium Term Revenue & Expenditure Framework","2025/26 Medium Term Revenue & Expenditure Framework","2026/27 Medium Term Revenue & Expenditure Framework"]
["1st year of MTREF",{"$f":"\"Budget Year \"&B1&\"/\"&RIGHT(B1,2)+1","v":"Budget Year 2013/14"},"Budget Year 2014/15","Budget Year 2015/16","Budget Year 2016/17","Budget Year 2017/18","Budget Year 2018/19","Budget Year 2019/20","Budget Year 2020/21","Budget Year 2021/22","Budget Year 2022/23","Budget Year 2023/24","Budget Year 2024/25","Budget Year 2025/26","Budget Year 2026/27"]
{"$rows_left_out":279}
{"sheet":"F1-Sum","index":4,"n_rows":52,"n_cols":10,"rows_kept":52,"cut":false,"hidden":false,"merged":[[2,3,3,3],[2,4,3,4],[2,5,3,5],[2,6,3,6],[1,0,2,0],[2,2,3,2],[1,2,1,9],[2,9,3,9],[2,1,3,1],[2,7,3,7],[2,8,3,8]]}
[{"$f":"MERsum&\" - \"&Date","v":" - Table F1 Monthly Budget Statement Summary - M01 July"}]
[{"$f":"desc","v":"Description"},{"$f":"Head1","v":"2023/24"},{"$f":"Head2","v":"Current Year 2024/25"}]
[null,{"$f":"Head5","v":"Audited Outcome"},{"$f":"Head6","v":"Original Budget"},{"$f":"Head7","v":"Adjusted Budget"},{"$f":"Head38","v":"Monthly actual"},{"$f":"Head39","v":"YearTD actual"},{"$f":"Head40","v":"YearTD budget"},{"$f":"Head41","v":"YTD variance"},{"$f":"Head41&\" %\"","v":"YTD variance %"},{"$f":"Head8","v":"Full Year Forecast"}]
["R thousands",null,{"$f":"Head6","v":"Original Budget"},{"$f":"Head7","v":"Adjusted Budget"},{"$f":"Head38","v":"Monthly actual"},{"$f":"Head39","v":"YearTD actual"},{"$f":"Head40","v":"YearTD budget"},{"$f":"Head41","v":"YTD variance"},{"$f":"Head41","v":"YTD variance"},{"$f":"Head8","v":"Full Year Forecast"}]
["Financial Performance"]
["Property rates",{"$f":"+'F2-FinPerf'!C22","v":0},{"$f":"+'F2-FinPerf'!D22","v":0},{"$f":"+'F2-FinPerf'!E22","v":0},{"$f":"+'F2-FinPerf'!F22","v":0},{"$f":"+'F2-FinPerf'!G22","v":0},{"$f":"+'F2-FinPerf'!H22","v":0},{"$f":"F6-G6","v":0},{"$f":"IF(H6=0,\"\",H6/G6)","v":""},{"$f":"+'F2-FinPerf'!K22","v":0}]
["Service charges",{"$f":"SUM('F2-FinPerf'!C7:C10)","v":0},{"$f":"SUM('F2-FinPerf'!D7:D10)","v":0},{"$f":"SUM('F2-FinPerf'!E7:E10)","v":0},{"$f":"SUM('F2-FinPerf'!F7:F10)","v":0},{"$f":"SUM('F2-FinPerf'!G7:G10)","v":0},{"$f":"SUM('F2-FinPerf'!H7:H10)","v":0},0,{"$f":"IF(H7=0,\"\",H7/G7)","v":""},{"$f":"SUM('F2-FinPerf'!K7:K10)","v":0}]
["Investment revenue",{"$f":"SUM('F2-FinPerf'!C15)","v":0},{"$f":"SUM('F2-FinPerf'!D15)","v":0},{"$f":"SUM('F2-FinPerf'!E15)","v":0},{"$f":"SUM('F2-FinPerf'!F15)","v":0},{"$f":"SUM('F2-FinPerf'!G15)","v":0},{"$f":"SUM('F2-FinPerf'!H15)","v":0},0,{"$f":"IF(H8=0,\"\",H8/G8)","v":""},{"$f":"SUM('F2-FinPerf'!K15)","v":0}]
{"$rows_left_out":45}
{"sheet":"F2-FinPerf","index":5,"n_rows":82,"n_cols":11,"rows_kept":82,"cut":false,"hidden":false,"merged":[[1,0,2,0],[1,1,2,1]]}
[{"$f":"_MER1&\" - \"&Date","v":" - Table F2 Monthly Budget Statement - Financial Performance (revenue and expenditure) - M01 July"}]
[{"$f":"desc","v":"Description"},{"$f":"head27","v":"Ref"},{"$f":"Head1","v":"2023/24"},{"$f":"Head2","v":"Current Year 2024/25"}]
[null,null,{"$f":"Head5","v":"Audited Outcome"},{"$f":"Head6","v":"Original Budget"},{"$f":"Head7","v":"Adjusted Budget"},{"$f":"Head38","v":"Monthly actual"},{"$f":"Head39","v":"YearTD actual"},{"$f":"Head40","v":"YearTD budget"},{"$f":"Head41","v":"YTD variance"},{"$f":"Head41","v":"YTD variance"},{"$f":"Head8","v":"Full Year Forecast"}]
["R thousands",null,null,null,null,null,null,null,null,"%"]
["Revenue",1]
["Exchange Revenue",null,null,null,null,null,null,null,{"$f":"G6-H6","v":0},{"$f":"IF(I6=0,\"\",I6/H6)","v":""}]
["Service charges - Electricity",null,null,null,null,null,null,null,{"$f":"G7-H7","v":0},{"$f":"IF(I7=0,\"\",I7/H7)","v":""}]
["Service charges - Water",null,null,null,null,null,null,null,0,""]
{"$rows_left_out":75}
{"sheet":"F3-Capex","index":6,"n_rows":194,"n_cols":11,"rows_kept":194,"cut":false,"hidden":false,"merged":[[1,0,2,0],[1,1,2,1]]}
[{"$f":"_MER2&\" - \"&Date","v":" - Table F3 Monthly Budget Statement - Capital Expenditure - M01 July"}]
["Description","Ref",{"$f":"Head1","v":"2023/24"},{"$f":"Head2","v":"Current Year 2024/25"}]
[null,null,"Audited Outcome","Original Budget","Adjusted Budget","Monthly actual","YearTD actual","YearTD budget","YTD variance","YTD variance","Full Year Forecast"]
["R thousands",1,null,null,null,null,null,null,null,"%"]
["Capital expenditure by Asset Class/Sub-class"]
[]
["Infrastructure",null,{"$f":"SF8a!C7+SF8b!C7+SF8e!C7","v":0},{"$f":"SF8a!D7+SF8b!D7+SF8e!D7","v":0},{"$f":"SF8a!E7+SF8b!E7+SF8e!E7","v":0},{"$f":"SF8a!F7+SF8b!F7+SF8e!F7","v":0},{"$f":"SF8a!G7+SF8b!G7+SF8e!G7","v":0},{"$f":"SF8a!H7+SF8b!H7+SF8e!H7","v":0},{"$f":"H7-G7","v":0},{"$f":"IF(I7=0,\"\",I7/H7)","v":""},{"$f":"SF8a!K7+SF8b!K7+SF8e!K7","v":0}]
["Roads Infrastructure",null,{"$f":"SF8a!C8+SF8b!C8+SF8e!C8","v":0},{"$f":"SF8a!D8+SF8b!D8+SF8e!D8","v":0},{"$f":"SF8a!E8+SF8b!E8+SF8e!E8","v":0},{"$f":"SF8a!F8+SF8b!F8+SF8e!F8","v":0},{"$f":"SF8a!G8+SF8b!G8+SF8e!G8","v":0},{"$f":"SF8a!H8+SF8b!H8+SF8e!H8","v":0},0,"",{"$f":"SF8a!K8+SF8b!K8+SF8e!K8","v":0}]
{"$rows_left_out":187}
{"sheet":"F4-FinPos","index":7,"n_rows":58,"n_cols":7,"rows_kept":58,"cut":false,"hidden":false,"merged":[[1,0,2,0],[1,1,2,1]]}
[{"$f":"_MER3&\" - \"&Date","v":" - Table F4 Monthly Budget Statement - Financial Position - M01 July"}]
[{"$f":"Vdesc","v":"Vote Description"},{"$f":"head27","v":"Ref"},{"$f":"Head1","v":"2023/24"},{"$f":"Head2","v":"Current Year 2024/25"}]
[null,null,{"$f":"Head5","v":"Audited Outcome"},{"$f":"Head6","v":"Original Budget"},{"$f":"Head7","v":"Adjusted Budget"},{"$f":"Head39","v":"YearTD actual"},{"$f":"Head8","v":"Full Year Forecast"}]
["R thousands"]
["ASSETS"]
["Current assets"]
["Cash and cash equivalents"]
["Trade and other receivables from exchange transactions"]
{"$rows_left_out":51}
{"sheet":"F5-CFlow","index":8,"n_rows":45,"n_cols":11,"rows_kept":45,"cut":false,"hidden":false,"merged":[[1,0,2,0],[1,1,2,1]]}
[{"$f":"_MER4&\" - \"&Date","v":" - Table F5 Monthly Budget Statement - Cash Flows - M01 July"}]
[{"$f":"desc","v":"Description"},{"$f":"head27","v":"Ref"},{"$f":"Head1","v":"2023/24"},{"$f":"Head2","v":"Current Year 2024/25"}]
[null,null,{"$f":"Head5","v":"Audited Outcome"},{"$f":"Head6","v":"Original Budget"},{"$f":"Head7","v":"Adjusted Budget"},{"$f":"Head38","v":"Monthly actual"},{"$f":"Head39","v":"YearTD actual"},{"$f":"Head40","v":"YearTD budget"},{"$f":"Head41","v":"YTD variance"},{"$f":"Head41","v":"YTD variance"},{"$f":"Head8","v":"Full Year Forecast"}]
["R thousands",null,null,null,null,null,null,null,null,"%"]
["CASH FLOW FROM OPERATING ACTIVITIES"]
["Receipts"]
["Property rates",null,null,null,null,null,null,null,{"$f":"G7-H7","v":0},{"$f":"IF(I7=0,\"\",I7/H7)","v":""}]
["Service charges",null,null,null,null,null,null,null,0,""]
{"$rows_left_out":38}
{"sheet":"SF1","index":9,"n_rows":35,"n_cols":5,"rows_kept":35,"cut":false,"hidden":false,"merged":[[1,4,2,4],[1,0,2,0],[1,1,2,1],[1,2,2,2],[1,3,2,3]]}
[{"$f":"_MER5&\" - \"&Date","v":" - Supporting Table F1 Entity Material variance explanation - M01 July"}]
[{"$f":"desc","v":"Description"},{"$f":"head27","v":"Ref"},"Variance","Reasons for material deviations","Remedial or corrective steps / remarks"]
[]
["R thousands"]
["Revenue items"]
[]
[]
[]
{"$rows_left_out":28}
{"sheet":"SF2","index":10,"n_rows":44,"n_cols":8,"rows_kept":44,"cut":false,"hidden":false,"merged":[[1,0,2,0],[1,1,2,1],[1,2,2,2]]}
[{"$f":"_MER7&\" - \"&Date","v":" - Supporting Table F2 Entity Financial and non-financial indicators - M01 July"}]
["Description of financial indicator","Basis of calculation",{"$f":"head27","v":"Ref"},{"$f":"Head1","v":"2023/24"},{"$f":"Head2","v":"Current Year 2024/25"}]
[null,null,null,{"$f":"Head5","v":"Audited Outcome"},{"$f":"Head6","v":"Original Budget"},{"$f":"Head7","v":"Adjusted Budget"},{"$f":"Head39","v":"YearTD actual"},{"$f":"Head8","v":"Full Year Forecast"}]
["Borrowing Management"]
["Borrowing to Asset Ratio","Total Long-term Borrowing/ Total Assets",null,{"$f":"IF(ISERROR('F4-FinPos'!C42/'F4-FinPos'!C28),0,('F4-FinPos'!C42/'F4-FinPos'!C28))","v":0},{"$f":"IF(ISERROR('F4-FinPos'!D42/'F4-FinPos'!D28),0,('F4-FinPos'!D42/'F4-FinPos'!D28))","v":0},{"$f":"IF(ISERROR('F4-FinPos'!E42/'F4-FinPos'!E28),0,('F4-FinPos'!E42/'F4-FinPos'!E28))","v":0},{"$f":"IF(ISERROR('F4-FinPos'!F42/'F4-FinPos'!F28),0,('F4-FinPos'!F42/'F4-FinPos'!F28))","v":0},{"$f":"IF(ISERROR('F4-FinPos'!G42/'F4-FinPos'!G28),0,('F4-FinPos'!G42/'F4-FinPos'!G28))","v":0}]
["Capital Charges to Operating Expenditure","Interest & Depreciation /Operating Expenditure",null,{"$f":"IF(ISERROR(('F2-FinPerf'!C40+'F2-FinPerf'!C41)/'F2-FinPerf'!C48),0,(('F2-FinPerf'!C40+'F2-FinPerf'!C41)/'F2-FinPerf'!C48))","v":0},{"$f":"IF(ISERROR(('F2-FinPerf'!D40+'F2-FinPerf'!D41)/'F2-FinPerf'!D48),0,(('F2-FinPerf'!D40+'F2-FinPerf'!D41)/'F2-FinPerf'!D48))","v":0},{"$f":"IF(ISERROR(('F2-FinPerf'!E40+'F2-FinPerf'!E41)/'F2-FinPerf'!E48),0,(('F2-FinPerf'!E40+'F2-FinPerf'!E41)/'F2-FinPerf'!E48))","v":0},{"$f":"IF(ISERROR(('F2-FinPerf'!F40+'F2-FinPerf'!F41)/'F2-FinPerf'!F48),0,(('F2-FinPerf'!F40+'F2-FinPerf'!F41)/'F2-FinPerf'!F48))","v":0},{"$f":"IF(ISERROR(('F2-FinPerf'!G40+'F2-FinPerf'!G41)/'F2-FinPerf'!G48),0,(('F2-FinPerf'!G40+'F2-FinPerf'!G41)/'F2-FinPerf'!G48))","v":0}]
["Borrowed funding of 'own' capital expenditure","Borrowing/Capital expenditure excl. transfers and grants and contributions",null,{"$f":"IF(ISERROR('F3-Capex'!#REF!/('F3-Capex'!#REF!-'F3-Capex'!#REF!-'F3-Capex'!#REF!)),0,('F3-Capex'!#REF!/('F3-Capex'!#REF!-'F3-Capex'!#REF!-'F3-Capex'!#REF!)))","v":0},{"$f":"IF(ISERROR('F3-Capex'!#REF!/('F3-Capex'!#REF!-'F3-Capex'!#REF!-'F3-Capex'!#REF!)),0,('F3-Capex'!#REF!/('F3-Capex'!#REF!-'F3-Capex'!#REF!-'F3-Capex'!#REF!)))","v":0},{"$f":"IF(ISERROR('F3-Capex'!#REF!/('F3-Capex'!#REF!-'F3-Capex'!#REF!-'F3-Capex'!#REF!)),0,('F3-Capex'!#REF!/('F3-Capex'!#REF!-'F3-Capex'!#REF!-'F3-Capex'!#REF!)))","v":0},{"$f":"IF(ISERROR('F3-Capex'!#REF!/('F3-Capex'!#REF!-'F3-Capex'!#REF!-'F3-Capex'!#REF!)),0,('F3-Capex'!#REF!/('F3-Capex'!#REF!-'F3-Capex'!#REF!-'F3-Capex'!#REF!)))","v":0},{"$f":"IF(ISERROR('F3-Capex'!#REF!/('F3-Capex'!#REF!-'F3-Capex'!#REF!-'F3-Capex'!#REF!)),0,('F3-Capex'!#REF!/('F3-Capex'!#REF!-'F3-Capex'!#REF!-'F3-Capex'!#REF!)))","v":0}]
["Safety of Capital"]
{"$rows_left_out":37}
{"sheet":"SF3","index":11,"n_rows":24,"n_cols":14,"rows_kept":24,"cut":false,"hidden":false,"merged":[[2,5,3,5],[1,2,1,13],[2,6,3,6],[2,7,3,7],[2,13,3,13],[2,8,3,8],[2,9,3,9],[2,10,3,10],[2,12,3,12],[2,11,3,11],[1,0,2,0],[1,1,3,1],[2,2,3,2],[2,3,3,3],[2,4,3,4]]}
[{"$f":"_MER9&\" - \"&Date","v":" - Supporting Table F3 Entity Aged debtors - M01 July"}]
["Detail","NT Code",{"$f":"Head2","v":"Current Year 2024/25"}]
[null,null,"0 - \n30 Days","31 - \n60 Days","61 - \n90 Days","91 - \n120 Days","121 - \n150 Days","151 - \n180 Days","181 Days -\n1 Year","Over 1\nYear","Total\n","Total \nover 90 days","Actual Bad Debts Written Off against Debtors","Impairment - Bad Debts i.t.o Council Policy"]
["R thousands"]
["Debtors Age Analysis By Income Source","1100"]
["Trade and Other Receivables from Exchange Transactions - Water","1200",null,null,null,null,null,null,null,null,{"$f":"SUM(C6:J6)","v":0},{"$f":"SUM(F6:J6)","v":0}]
["Trade and Other Receivables from Exchange Transactions - Electricity","1300",null,null,null,null,null,null,null,null,0,{"$f":"SUM(F7:J7)","v":0}]
["Receivables from Non-exchange Transactions - Property Rates","1400",null,null,null,null,null,null,null,null,0,0]
{"$rows_left_out":17}
{"sheet":"SF4","index":12,"n_rows":18,"n_cols":12,"rows_kept":18,"cut":false,"hidden":false,"merged":[[2,7,3,7],[1,11,3,11],[2,8,3,8],[2,9,3,9],[2,10,3,10],[2,5,3,5],[2,6,3,6],[1,0,2,0],[1,1,3,1],[2,2,3,2],[2,3,3,3],[2,4,3,4]]}
[{"$f":"_MER10&\" - \"&Date","v":" - Supporting Table F4 Entity Aged creditors - M01 July"}]
["Detail","NT Code",{"$f":"Head2","v":"Current Year 2024/25"},null,null,null,null,null,null,null,null,"Prior year totals for chart (same period)"]
[null,null,"0 - \n30 Days","31 - \n60 Days","61 - \n90 Days","91 - \n120 Days","121 - \n150 Days","151 - \n180 Days","181 Days -\n1 Year","Over 1\nYear","Total\n"]
["R thousands"]
["Creditors Age Analysis By Customer Type"]
["Bulk Electricity","0100",null,null,null,null,null,null,null,null,{"$f":"SUM(C6:J6)","v":0}," "]
["Bulk Water","0200",null,null,null,null,null,null,null,null,{"$f":"SUM(C7:J7)","v":0}]
["PAYE deductions","0300",null,null,null,null,null,null,null,null,0," "]
{"$rows_left_out":11}
{"sheet":"SF5","index":13,"n_rows":20,"n_cols":15,"rows_kept":20,"cut":false,"hidden":false,"merged":[[1,1,2,1]]}
[{"$f":"_MER11&\" - \"&Date","v":" - Supporting Table F5 Entity investment portfolio monthly statement - M01 July"}]
["Investments by maturity\nName of institution & investment ID",{"$f":"head27","v":"Ref"},"Period of Investment","Type of Investment","Capital Guarantee\n(Yes/ No)","Variable or Fixed interest rate","Interest Rate ᶟ","Commission Paid (Rands)","Commission Recipient","Expiry date of investment","Opening balance","Interest to be realised","Partial / Premature Withdrawal (4)","Investment Top Up","Closing Balance"]
["R thousands",null,"Yrs/Months"]
["Entity"]
[null,null,null,null,null,null,null,null,null,null,null,null,null,null,{"$f":"SUM(K5:N5)","v":0}]
[null,null,null,null,null,null,null,null,null,null,null,null,null,null,0]
[null,null,null,null,null,null,null,null,null,null,null,null,null,null,0]
[null,null,null,null,null,null,null,null,null,null,null,null,null,null,0]
{"$rows_left_out":13}
{"sheet":"SF6","index":14,"n_rows":104,"n_cols":11,"rows_kept":104,"cut":false,"hidden":false,"merged":[[1,0,3,0],[1,1,3,1]]}
[{"$f":"_MER8&\" - \"&Date","v":" - Supporting Table F6 Entity Board member allowances & staff benefits - M01 July"}]
["Summary of Employee and Board Member remuneration",{"$f":"head27","v":"Ref"},{"$f":"Head1","v":"2023/24"},{"$f":"Head2","v":"Current Year 2024/25"}]
[null,null,{"$f":"Head5","v":"Audited Outcome"},{"$f":"Head6","v":"Original Budget"},{"$f":"Head7","v":"Adjusted Budget"},{"$f":"Head38","v":"Monthly actual"},{"$f":"Head39","v":"YearTD actual"},{"$f":"Head40","v":"YearTD budget"},{"$f":"Head41","v":"YTD variance"},{"$f":"Head41","v":"YTD variance"},{"$f":"Head8","v":"Full Year Forecast"}]
[null,null,null,null,null,null,null,null,null,"%"]
["R thousands",null,"A","B","C",null,null,null,null,null,"D"]
["Remuneration"]
["Board Members of Entities"]
["Basic Salaries and Wages",null,null,null,null,null,null,null,{"$f":"G8-H8","v":0},{"$f":"IF(I8=0,\"\",I8/H8)","v":""}]
{"$rows_left_out":97}
{"sheet":"SF7","index":15,"n_rows":57,"n_cols":16,"rows_kept":57,"cut":false,"hidden":false,"merged":[[1,1,1,12],[1,13,1,15],[56,0,56,15]]}
[{"$f":"_MER13&\" - \"&Date","v":" - Supporting Table F7 Entity monthly actuals & revised targets - M01 July"}]
[{"$f":"desc","v":"Description"},{"$f":"Head9","v":"Budget Year 2025/26"},null,null,null,null,null,null,null,null,null,null,null,{"$f":"Head3a","v":"Medium Term Revenue and Expenditure Framework"}]
["R thousands","July","August","Sept.","October","November","December","January","February","March","April","May","June",{"$f":"Head9","v":"Budget Year 2025/26"},{"$f":"Head10","v":"Budget Year +1 2026/27"},{"$f":"Head11","v":"Budget Year +2 2027/28"}]
["Cash Receipts By Source",null,null,null,null,null,null,null,null,null,null,null,null,1]
[{"$f":"'[1]A4-FinPerf RE'!A5","v":"Property rates"},null,null,null,null,null,null,null,null,null,null,null,{"$f":"N5-SUM(B5:L5)","v":0}]
[{"$f":"'[1]A4-FinPerf RE'!A6","v":"Service charges - electricity revenue"},null,null,null,null,null,null,null,null,null,null,null,0]
[{"$f":"'[1]A4-FinPerf RE'!A7","v":"Service charges - water revenue"},null,null,null,null,null,null,null,null,null,null,null,0]
[{"$f":"'[1]A4-FinPerf RE'!A8","v":"Service charges - sanitation revenue"},null,null,null,null,null,null,null,null,null,null,null,0]
{"$rows_left_out":50}
{"sheet":"SF8a","index":16,"n_rows":177,"n_cols":11,"rows_kept":177,"cut":false,"hidden":false,"merged":[[1,0,2,0],[1,1,2,1]]}
[{"$f":"MER12a&\" - \"&Date","v":" - Supporting Table F8a Entity capital expenditure on new assets by asset class - M01 July"}]
[{"$f":"desc","v":"Description"},{"$f":"head27","v":"Ref"},{"$f":"Head1","v":"2023/24"},{"$f":"Head2","v":"Current Year 2024/25"}]
[null,null,{"$f":"Head5","v":"Audited Outcome"},{"$f":"Head6","v":"Original Budget"},{"$f":"Head7","v":"Adjusted Budget"},{"$f":"Head38","v":"Monthly actual"},{"$f":"Head39","v":"YearTD actual"},{"$f":"Head40","v":"YearTD budget"},{"$f":"Head41","v":"YTD variance"},{"$f":"Head41","v":"YTD variance"},{"$f":"Head8","v":"Full Year Forecast"}]
["R thousands",1,null,null,null,null,null,null,null,"%"]
["Capital expenditure on new assets by Asset Class/Sub-class"]
[]
["Infrastructure",null,{"$f":"C8+C13+C17+C27+C38+C45+C53+C63+C69","v":0},0,0,0,0,0,{"$f":"H7-G7","v":0},{"$f":"IF(I7=0,\"\",I7/H7)","v":""},{"$f":"K8+K13+K17+K27+K38+K45+K53+K63+K69","v":0}]
["Roads Infrastructure",null,{"$f":"SUM(C9:C12)","v":0},0,0,0,0,0,0,"",{"$f":"SUM(K9:K12)","v":0}]
{"$rows_left_out":170}
{"sheet":"SF8b","index":17,"n_rows":179,"n_cols":11,"rows_kept":179,"cut":false,"hidden":false,"merged":[[1,0,2,0],[1,1,2,1]]}
[{"$f":"MER12b&\" - \"&Date","v":" - Supporting Table F8b Entity capital expenditure on the renewal of existing assets by asset class - M01 July"}]
[{"$f":"desc","v":"Description"},{"$f":"head27","v":"Ref"},{"$f":"Head1","v":"2023/24"},{"$f":"Head2","v":"Current Year 2024/25"}]
[null,null,{"$f":"Head5","v":"Audited Outcome"},{"$f":"Head6","v":"Original Budget"},{"$f":"Head7","v":"Adjusted Budget"},{"$f":"Head38","v":"Monthly actual"},{"$f":"Head39","v":"YearTD actual"},{"$f":"Head40","v":"YearTD budget"},{"$f":"Head41","v":"YTD variance"},{"$f":"Head41","v":"YTD variance"},{"$f":"Head8","v":"Full Year Forecast"}]
["R thousands",1,null,null,null,null,null,null,null,"%"]
["Capital expenditure on renewal of existing assets by Asset Class/Sub-class"]
[]
["Infrastructure",null,{"$f":"C8+C13+C17+C27+C38+C45+C53+C63+C69","v":0},0,0,0,0,0,{"$f":"H7-G7","v":0},{"$f":"IF(I7=0,\"\",I7/H7)","v":""},{"$f":"K8+K13+K17+K27+K38+K45+K53+K63+K69","v":0}]
["Roads Infrastructure",null,{"$f":"SUM(C9:C12)","v":0},0,0,0,0,0,0,"",{"$f":"SUM(K9:K12)","v":0}]
{"$rows_left_out":172}
{"sheet":"SF8c","index":18,"n_rows":177,"n_cols":11,"rows_kept":177,"cut":false,"hidden":false,"merged":[[1,0,2,0],[1,1,2,1]]}
[{"$f":"MER12c&\" - \"&Date","v":" - Supporting Table F8c Entity expenditure on repairs and maintenance by asset class - M01 July"}]
[{"$f":"desc","v":"Description"},{"$f":"head27","v":"Ref"},{"$f":"Head1","v":"2023/24"},{"$f":"Head2","v":"Current Year 2024/25"}]
[null,null,{"$f":"Head5","v":"Audited Outcome"},{"$f":"Head6","v":"Original Budget"},{"$f":"Head7","v":"Adjusted Budget"},{"$f":"Head38","v":"Monthly actual"},{"$f":"Head39","v":"YearTD actual"},{"$f":"Head40","v":"YearTD budget"},{"$f":"Head41","v":"YTD variance"},{"$f":"Head41","v":"YTD variance"},{"$f":"Head8","v":"Full Year Forecast"}]
["R thousands",1,null,null,null,null,null,null,null,"%"]
["Repairs and maintenance expenditure by Asset Class/Sub-class"]
[]
["Infrastructure",null,{"$f":"C8+C13+C17+C27+C38+C45+C53+C63+C69","v":0},0,0,0,0,0,{"$f":"H7-G7","v":0},{"$f":"IF(I7=0,\"\",I7/H7)","v":""},{"$f":"K8+K13+K17+K27+K38+K45+K53+K63+K69","v":0}]
["Roads Infrastructure",null,{"$f":"SUM(C9:C12)","v":0},0,0,0,0,0,0,"",{"$f":"SUM(K9:K12)","v":0}]
{"$rows_left_out":170}
{"sheet":"SF8d","index":19,"n_rows":177,"n_cols":11,"rows_kept":177,"cut":false,"hidden":false,"merged":[[1,0,2,0],[1,1,2,1]]}
[{"$f":"MER12d&\" - \"&Date","v":" - Supporting Table F8d Entity Depreciation by asset class - M01 July"}]
[{"$f":"desc","v":"Description"},{"$f":"head27","v":"Ref"},{"$f":"Head1","v":"2023/24"},{"$f":"Head2","v":"Current Year 2024/25"}]
[null,null,{"$f":"Head5","v":"Audited Outcome"},{"$f":"Head6","v":"Original Budget"},{"$f":"Head7","v":"Adjusted Budget"},{"$f":"Head38","v":"Monthly actual"},{"$f":"Head39","v":"YearTD actual"},{"$f":"Head40","v":"YearTD budget"},{"$f":"Head41","v":"YTD variance"},{"$f":"Head41","v":"YTD variance"},{"$f":"Head8","v":"Full Year Forecast"}]
["R thousands",1,null,null,null,null,null,null,null,"%"]
["Depreciation by Asset Class/Sub-class"]
[]
["Infrastructure",null,{"$f":"C8+C13+C17+C27+C38+C45+C53+C63+C69","v":0},0,0,0,0,0,{"$f":"H7-G7","v":0},{"$f":"IF(I7=0,\"\",I7/H7)","v":""},{"$f":"K8+K13+K17+K27+K38+K45+K53+K63+K69","v":0}]
["Roads Infrastructure",null,{"$f":"SUM(C9:C12)","v":0},0,0,0,0,0,0,"",{"$f":"SUM(K9:K12)","v":0}]
{"$rows_left_out":170}
{"sheet":"SF8e","index":20,"n_rows":177,"n_cols":11,"rows_kept":177,"cut":false,"hidden":false,"merged":[[1,0,2,0],[1,1,2,1]]}
[{"$f":"MER12e&\" - \"&Date","v":" - Supporting Table F8e Entity capital expenditure on the upgrading of existing assets by asset class - M01 July"}]
[{"$f":"desc","v":"Description"},{"$f":"head27","v":"Ref"},{"$f":"Head1","v":"2023/24"},{"$f":"Head2","v":"Current Year 2024/25"}]
[null,null,{"$f":"Head5","v":"Audited Outcome"},{"$f":"Head6","v":"Original Budget"},{"$f":"Head7","v":"Adjusted Budget"},{"$f":"Head38","v":"Monthly actual"},{"$f":"Head39","v":"YearTD actual"},{"$f":"Head40","v":"YearTD budget"},{"$f":"Head41","v":"YTD variance"},{"$f":"Head41","v":"YTD variance"},{"$f":"Head8","v":"Full Year Forecast"}]
["R thousands",1,null,null,null,null,null,null,null,"%"]
["Capital expenditure on upgrading of existing assets by Asset Class/Sub-class"]
[]
["Infrastructure",null,{"$f":"C8+C13+C17+C27+C38+C45+C53+C63+C69","v":0},0,0,0,0,0,{"$f":"H7-G7","v":0},{"$f":"IF(I7=0,\"\",I7/H7)","v":""},{"$f":"K8+K13+K17+K27+K38+K45+K53+K63+K69","v":0}]
["Roads Infrastructure",null,{"$f":"SUM(C9:C12)","v":0},0,0,0,0,0,0,"",{"$f":"SUM(K9:K12)","v":0}]
{"$rows_left_out":169}